Author Topic: Help i have a Error in Installation  (Read 9422 times)

0 Members and 1 Guest are viewing this topic.

Offline
*
Help i have a Error in Installation
« on: March 10, 2016, 04:29:07 PM »
System: CentOS 6.7

Error:
Quote
[root@webserverv2 src]# sh cwp-latest
Complete!

PREPARING THE SERVER
##########################
iptables: Saving firewall rules to /etc/sysconfig/iptables:[  OK  ]
iptables: Setting chains to policy ACCEPT: mangle security [FAILED]filter
iptables: Flushing firewall rules:                         [  OK  ]
iptables: Unloading modules:  iptable_mangle iptable_security iptable_raw iptable_nat iptable_filter iptable_mangle iptable_security iptable_raw iptable_nat iptable_filter ip_tables                                      [FAILED]

#############################################
Please wait... installing web server files...
#############################################

/usr/local/src/apache-2.2.27.sh: line 25: tar: command not found
chown: cannot access `apr-1.5.1/': No such file or directory
/usr/local/src/apache-2.2.27.sh: line 27: cd: apr-1.5.1/: No such file or directory
/usr/local/src/apache-2.2.27.sh: line 29: ./configure: No such file or directory
make: *** No targets specified and no makefile found.  Stop.
make: *** No rule to make target `install'.  Stop.
/usr/local/src/apache-2.2.27.sh: line 36: tar: command not found
chown: cannot access `apr-util-1.5.3/': No such file or directory
/usr/local/src/apache-2.2.27.sh: line 38: cd: apr-util-1.5.3/: No such file or directory
/usr/local/src/apache-2.2.27.sh: line 40: ./configure: No such file or directory
make: *** No targets specified and no makefile found.  Stop.
make: *** No rule to make target `install'.  Stop.
/usr/local/src/apache-2.2.27.sh: line 47: tar: command not found
chown: cannot access `httpd-2.2.27/': No such file or directory
/usr/local/src/apache-2.2.27.sh: line 49: cd: httpd-2.2.27/: No such file or directory
rm: cannot remove `/usr/local/apache/conf/httpd.conf': No such file or directory
/usr/local/src/apache-2.2.27.sh: line 52: ./configure: No such file or directory
make: *** No targets specified and no makefile found.  Stop.
make: *** No rule to make target `install'.  Stop.
/usr/local/src/apache-2.2.27.sh: line 57: /usr/local/apache/conf/httpd.conf: No such file or directory
/usr/local/src/apache-2.2.27.sh: line 58: /usr/local/apache/conf/httpd.conf: No such file or directory
mkdir: cannot create directory `/usr/local/apache/conf.d': No such file or directory
touch: cannot touch `/usr/local/apache/conf.d/empty.conf': No such file or directory
/usr/local/src/apache-2.2.27.sh: line 61: /usr/local/apache/conf/httpd.conf: No such file or directory
sed: can't read /usr/local/apache/conf/httpd.conf: No such file or directory
/usr/local/src/apache-2.2.27.sh: line 65: /usr/local/apache/conf/httpd.conf: No such file or directory
/usr/local/src/apache-2.2.27.sh: line 72: /usr/local/apache/conf/sharedip.conf: No such file or directory
/usr/local/src/apache-2.2.27.sh: line 94: tar: command not found
chown: cannot access `suphp-0.7.1/': No such file or directory
/usr/local/src/apache-2.2.27.sh: line 96: cd: suphp-0.7.1/: No such file or directory
Loaded plugins: fastestmirror
Setting up Install Process
Loading mirror speeds from cached hostfile
 * base: centos.mirrors.ovh.net
 * extras: mirrors.ircam.fr
 * rpmforge: www.mirrorservice.org
 * updates: centos.mirror.fr.planethoster.net
Resolving Dependencies
--> Running transaction check
---> Package patch.x86_64 0:2.6-6.el6 will be installed
--> Finished Dependency Resolution

Dependencies Resolved

================================================================================
 Package          Arch              Version               Repository       Size
================================================================================
Installing:
 patch            x86_64            2.6-6.el6             base             90 k

Transaction Summary
================================================================================
Install       1 Package(s)

Total download size: 90 k
Installed size: 172 k
Downloading Packages:
patch-2.6-6.el6.x86_64.rpm                               |  90 kB     00:00
Running rpm_check_debug
Running Transaction Test
Transaction Test Succeeded
Running Transaction
  Installing : patch-2.6-6.el6.x86_64                                       1/1
  Verifying  : patch-2.6-6.el6.x86_64                                       1/1

Installed:
  patch.x86_64 0:2.6-6.el6

Complete!
/usr/local/src/apache-2.2.27.sh: line 100: cppatch/03_suphp_full_php_process_display.patch: No such file or directory
/usr/local/src/apache-2.2.27.sh: line 102: ./configure: No such file or directory
make: *** No targets specified and no makefile found.  Stop.
make: *** No rule to make target `install'.  Stop.
sed: can't read /usr/local/apache/conf/httpd.conf: No such file or directory
sed: can't read /usr/local/apache/conf/httpd.conf: No such file or directory
sed: can't read /usr/local/apache/conf/httpd.conf: No such file or directory
sed: can't read /usr/local/apache/conf/httpd.conf: No such file or directory
/usr/local/src/apache-2.2.27.sh: line 189: cd: /usr/local/apache/bin/: No such file or directory

Compiler requires 512 MB RAM + SWAP
Installation FAILED at httpd
  % Total    % Received % Xferd  Average Speed   Time    Time     Time  Current
                                 Dload  Upload   Total   Spent    Left  Speed
113   792  113   792    0     0  27509      0 --:--:-- --:--:-- --:--:-- 60923
sh: line 46: /usr/local/bin/php: No such file or directory
grep: /etc/init.d/httpd: No such file or directory
Array
(
    [operation] => upload
)
[root@webserverv2 src]#

Offline
*
Re: Help i have a Error in Installation
« Reply #1 on: March 10, 2016, 06:56:43 PM »
The this error have the Install from "sh cwp-latest"

The Command with "sh cwp-latest -d mariadb" work but its have realy much bugs,
Roundcube Error:
DATABASE ERROR: CONNECTION FAILED!

Unable to connect to the database!
Please contact your server-administrator.

PHPMyAdmin have the same Error as Roundcube........

Offline
*****
Re: Help i have a Error in Installation
« Reply #2 on: March 12, 2016, 03:34:26 AM »
create a 512mb/1gb swap to get rid of this problem installation of cwp needs more ram/memory

Offline
*
Re: Help i have a Error in Installation
« Reply #3 on: March 13, 2016, 10:01:51 PM »
i have look in my config.....

i have more than 1GB

http://i.imgur.com/HJnkRyo.png

Offline
*****
Re: Help i have a Error in Installation
« Reply #4 on: March 15, 2016, 11:18:37 AM »
unknown error contact support

Offline
*
Re: Help i have a Error in Installation
« Reply #5 on: March 17, 2016, 07:27:18 AM »
Same problem, anyone have a solution? :(

Offline
*****
Re: Help i have a Error in Installation
« Reply #6 on: March 17, 2016, 08:06:31 AM »
Hi, contact with support, please. It will be checked.
You can ask me to solve any problem with your server for some money in pm  ;)
Services Monitoring & RBL Monitoring
http://centos-webpanel.com/services-monitor
Join our Development Team and get paid !
http://centos-webpanel.com/develope-modules-for-cwp

Installation Instructions
http://centos-webpanel.com/installation-instructions
Get Fast Support Here
http://centos-webpanel.com/support-services

Offline
*
Re: Help i have a Error in Installation
« Reply #7 on: March 18, 2016, 12:57:09 PM »
contacted, need help

Offline
*
Re: Help i have a Error in Installation
« Reply #8 on: March 20, 2016, 10:55:18 AM »
be sure that you have the latest centos 6 64bit and that its fully update

update centos command
Code: [Select]
yum -y update
AntiDDoS Protection (web + mail)
http://centos-webpanel.com/website-ddos-protection-proxy

Join our Development Team and get paid !
http://centos-webpanel.com/develope-modules-for-cwp


Services Monitoring & RBL Monitoring
http://centos-webpanel.com/services-monitor


Do you need Fast and FREE Support included for your CWP linux server?
http://centos-webpanel.com/noc-partner-list
Installation Instructions
http://centos-webpanel.com/installation-instructions
Get Fast Support Here
http://centos-webpanel.com/support-services