Author Topic: PHP Version Switcher v2 not chaning PHP version  (Read 288 times)

0 Members and 1 Guest are viewing this topic.

Offline
*
PHP Version Switcher v2 not chaning PHP version
« on: May 07, 2020, 01:06:17 PM »
Just installed CWP. Installed 5.6 on it. Using switcher v2 it's not chaning php to 7.2.30.

I clicking to save & build and restarting server it's still PHP 5

Online
***
Re: PHP Version Switcher v2 not chaning PHP version
« Reply #1 on: May 07, 2020, 01:24:17 PM »
If you are relying on the phpinfo from CWP Admin Panel, that is not an accurate description of what PHP version your websites are using.  PHP Version Switcher is for the hosted websites.  So it may be confusing.
Google Hangouts:  rcschaff82@gmail.com

Offline
*
Re: PHP Version Switcher v2 not chaning PHP version
« Reply #2 on: May 07, 2020, 01:27:58 PM »
Tried with new created account but same :(

https://prnt.sc/scljiw


Online
***
Re: PHP Version Switcher v2 not chaning PHP version
« Reply #3 on: May 07, 2020, 02:46:50 PM »
It takes around 20 minutes to completely build, at which point it should switch version.  I just did it on a test server, and it worked for me.

You could try rebuilding the Vhosts to see if it's an issue with the Server itself.
Google Hangouts:  rcschaff82@gmail.com

Offline
*
Re: PHP Version Switcher v2 not chaning PHP version
« Reply #4 on: May 07, 2020, 05:00:15 PM »
I did everything. Rebuild all vhosts. Created new account and cheched inside them still same.

Maybe I chose nginx server today and get back to apache?

Online
***
Re: PHP Version Switcher v2 not chaning PHP version
« Reply #5 on: May 07, 2020, 05:26:05 PM »
If your using nginx as a reverse proxy, it should be a non factor.  If your using it standalone, it requires php-fpm.  If you did not install the fpm module for 7.2, then it will not work.
Google Hangouts:  rcschaff82@gmail.com

Offline
*
Re: PHP Version Switcher v2 not chaning PHP version
« Reply #6 on: May 07, 2020, 07:42:59 PM »
It doesn't work for me either.

PHP logs:

Code: [Select]
2020-04-30 03:01:57 (5.60 MB/s) - 'libzip-1.5.1.tar.gz.1' saved [1189827/1189827]

tar (child): libzip-1.5.1: Cannot read: Is a directory
tar (child): At beginning of tape, quitting now
tar (child): Error is not recoverable: exiting now

gzip: stdin: unexpected end of file
tar: Child returned status 2
tar: Error is not recoverable: exiting now
mkdir: cannot create directory 'build': File exists
-- Could NOT find NETTLE (missing: NETTLE_LIBRARY NETTLE_INCLUDE_DIR)
-- Could NOT find GnuTLS (missing: GNUTLS_LIBRARY GNUTLS_INCLUDE_DIR)
-- Configuring done
-- Generating done
-- Build files have been written to: /usr/local/src/libzip-1.5.1/build
[ 46%] Built target zip
[ 85%] Built target man
[ 85%] Linking C executable ziptool
../lib/libzip.so.5.0: undefined reference to `HMAC_CTX_free'
../lib/libzip.so.5.0: undefined reference to `HMAC_CTX_new'
collect2: error: ld returned 1 exit status
make[2]: *** [src/ziptool] Error 1
make[1]: *** [src/CMakeFiles/ziptool.dir/all] Error 2
make: *** [all] Error 2

Code: [Select]
/usr/local/src/php-build/php-7.3.17/ext/openssl/openssl.c:2346: undefined reference to `X509_get_version'
/usr/local/src/php-build/php-7.3.17/ext/openssl/openssl.c:2373: undefined reference to `X509_getm_notBefore'
/usr/local/src/php-build/php-7.3.17/ext/openssl/openssl.c:2374: undefined reference to `X509_getm_notAfter'
/usr/local/src/php-build/php-7.3.17/ext/openssl/openssl.c:2376: undefined reference to `X509_getm_notBefore'
/usr/local/src/php-build/php-7.3.17/ext/openssl/openssl.c:2377: undefined reference to `X509_getm_notAfter'
ext/openssl/.libs/openssl.o: In function `sk_GENERAL_NAME_pop_free':
/usr/include/openssl/x509v3.h:166: undefined reference to `OPENSSL_sk_pop_free'
ext/openssl/.libs/openssl.o: In function `sk_GENERAL_NAME_num':
/usr/include/openssl/x509v3.h:166: undefined reference to `OPENSSL_sk_num'
ext/openssl/.libs/openssl.o: In function `sk_GENERAL_NAME_value':
/usr/include/openssl/x509v3.h:166: undefined reference to `OPENSSL_sk_value'
ext/openssl/.libs/openssl.o: In function `openssl_x509v3_subjectAltName':
/usr/local/src/php-build/php-7.3.17/ext/openssl/openssl.c:2276: undefined reference to `ASN1_STRING_get0_data'
ext/openssl/.libs/openssl.o: In function `sk_X509_new_null':
/usr/include/openssl/x509.h:99: undefined reference to `OPENSSL_sk_new_null'
ext/openssl/.libs/openssl.o: In function `sk_X509_free':
/usr/include/openssl/x509.h:99: undefined reference to `OPENSSL_sk_free'
ext/openssl/.libs/openssl.o: In function `sk_X509_INFO_free':
/usr/include/openssl/x509.h:254: undefined reference to `OPENSSL_sk_free'
ext/openssl/.libs/openssl.o: In function `sk_X509_INFO_shift':
/usr/include/openssl/x509.h:254: undefined reference to `OPENSSL_sk_shift'
ext/openssl/.libs/openssl.o: In function `sk_X509_push':
/usr/include/openssl/x509.h:99: undefined reference to `OPENSSL_sk_push'
ext/openssl/.libs/openssl.o: In function `sk_X509_INFO_num':
/usr/include/openssl/x509.h:254: undefined reference to `OPENSSL_sk_num'
ext/openssl/.libs/openssl.o: In function `sk_X509_num':
/usr/include/openssl/x509.h:99: undefined reference to `OPENSSL_sk_num'
ext/openssl/.libs/openssl.o: In function `sk_X509_free':
/usr/include/openssl/x509.h:99: undefined reference to `OPENSSL_sk_free'
/usr/include/openssl/x509.h:99: undefined reference to `OPENSSL_sk_free'
/usr/include/openssl/x509.h:99: undefined reference to `OPENSSL_sk_free'
ext/openssl/.libs/openssl.o: In function `sk_X509_pop_free':
/usr/include/openssl/x509.h:99: undefined reference to `OPENSSL_sk_pop_free'
ext/openssl/.libs/openssl.o: In function `sk_X509_new_null':
/usr/include/openssl/x509.h:99: undefined reference to `OPENSSL_sk_new_null'
ext/openssl/.libs/openssl.o: In function `sk_X509_push':
/usr/include/openssl/x509.h:99: undefined reference to `OPENSSL_sk_push'
/usr/include/openssl/x509.h:99: undefined reference to `OPENSSL_sk_push'
ext/openssl/.libs/openssl.o: In function `sk_X509_num':
/usr/include/openssl/x509.h:99: undefined reference to `OPENSSL_sk_num'
ext/openssl/.libs/openssl.o: In function `sk_X509_pop':
/usr/include/openssl/x509.h:99: undefined reference to `OPENSSL_sk_pop'
ext/openssl/.libs/openssl.o: In function `sk_X509_free':
/usr/include/openssl/x509.h:99: undefined reference to `OPENSSL_sk_free'
ext/openssl/.libs/openssl.o: In function `zif_openssl_csr_get_subject':
/usr/local/src/php-build/php-7.3.17/ext/openssl/openssl.c:3628: undefined reference to `X509_REQ_get_subject_name'
ext/openssl/.libs/openssl.o: In function `zif_openssl_pkey_get_details':
/usr/local/src/php-build/php-7.3.17/ext/openssl/openssl.c:4825: undefined reference to `EVP_PKEY_get0_DH'
/usr/local/src/php-build/php-7.3.17/ext/openssl/openssl.c:4832: undefined reference to `DH_get0_pqg'
/usr/local/src/php-build/php-7.3.17/ext/openssl/openssl.c:4833: undefined reference to `DH_get0_key'
/usr/local/src/php-build/php-7.3.17/ext/openssl/openssl.c:4847: undefined reference to `EVP_PKEY_get0_EC_KEY'
/usr/local/src/php-build/php-7.3.17/ext/openssl/openssl.c:4856: undefined reference to `EVP_PKEY_get0_EC_KEY'
/usr/local/src/php-build/php-7.3.17/ext/openssl/openssl.c:4803: undefined reference to `EVP_PKEY_get0_DSA'
/usr/local/src/php-build/php-7.3.17/ext/openssl/openssl.c:4810: undefined reference to `DSA_get0_pqg'
/usr/local/src/php-build/php-7.3.17/ext/openssl/openssl.c:4811: undefined reference to `DSA_get0_key'
/usr/local/src/php-build/php-7.3.17/ext/openssl/openssl.c:4774: undefined reference to `EVP_PKEY_get0_RSA'
/usr/local/src/php-build/php-7.3.17/ext/openssl/openssl.c:4781: undefined reference to `RSA_get0_key'
/usr/local/src/php-build/php-7.3.17/ext/openssl/openssl.c:4782: undefined reference to `RSA_get0_factors'
/usr/local/src/php-build/php-7.3.17/ext/openssl/openssl.c:4783: undefined reference to `RSA_get0_crt_params'
/usr/local/src/php-build/php-7.3.17/ext/openssl/openssl.c:4892: undefined reference to `EVP_PKEY_get0_EC_KEY'
ext/openssl/.libs/openssl.o: In function `zif_openssl_dh_compute_key':
/usr/local/src/php-build/php-7.3.17/ext/openssl/openssl.c:4935: undefined reference to `EVP_PKEY_get0_DH'
ext/openssl/.libs/openssl.o: In function `sk_X509_value':
/usr/include/openssl/x509.h:99: undefined reference to `OPENSSL_sk_value'
ext/openssl/.libs/openssl.o: In function `sk_X509_num':
/usr/include/openssl/x509.h:99: undefined reference to `OPENSSL_sk_num'
ext/openssl/.libs/openssl.o: In function `sk_X509_free':
/usr/include/openssl/x509.h:99: undefined reference to `OPENSSL_sk_free'
ext/openssl/.libs/openssl.o: In function `sk_X509_pop_free':
/usr/include/openssl/x509.h:99: undefined reference to `OPENSSL_sk_pop_free'
ext/openssl/.libs/openssl.o: In function `sk_X509_new_null':
/usr/include/openssl/x509.h:99: undefined reference to `OPENSSL_sk_new_null'
ext/openssl/.libs/openssl.o: In function `sk_X509_push':
/usr/include/openssl/x509.h:99: undefined reference to `OPENSSL_sk_push'
ext/openssl/.libs/openssl.o: In function `sk_X509_pop_free':
/usr/include/openssl/x509.h:99: undefined reference to `OPENSSL_sk_pop_free'
ext/openssl/.libs/openssl.o: In function `sk_X509_push':
/usr/include/openssl/x509.h:99: undefined reference to `OPENSSL_sk_push'
ext/openssl/.libs/openssl.o: In function `sk_X509_num':
/usr/include/openssl/x509.h:99: undefined reference to `OPENSSL_sk_num'
ext/openssl/.libs/openssl.o: In function `sk_X509_value':
/usr/include/openssl/x509.h:99: undefined reference to `OPENSSL_sk_value'
ext/openssl/.libs/openssl.o: In function `sk_X509_CRL_num':
/usr/include/openssl/x509.h:228: undefined reference to `OPENSSL_sk_num'
ext/openssl/.libs/openssl.o: In function `sk_X509_CRL_value':
/usr/include/openssl/x509.h:228: undefined reference to `OPENSSL_sk_value'
ext/openssl/.libs/openssl.o: In function `sk_X509_pop_free':
/usr/include/openssl/x509.h:99: undefined reference to `OPENSSL_sk_pop_free'
ext/openssl/.libs/openssl.o: In function `zif_openssl_private_encrypt':
/usr/local/src/php-build/php-7.3.17/ext/openssl/openssl.c:5683: undefined reference to `EVP_PKEY_get0_RSA'
ext/openssl/.libs/openssl.o: In function `zif_openssl_private_decrypt':
/usr/local/src/php-build/php-7.3.17/ext/openssl/openssl.c:5745: undefined reference to `EVP_PKEY_get0_RSA'
ext/openssl/.libs/openssl.o: In function `zif_openssl_public_encrypt':
/usr/local/src/php-build/php-7.3.17/ext/openssl/openssl.c:5813: undefined reference to `EVP_PKEY_get0_RSA'
ext/openssl/.libs/openssl.o: In function `zif_openssl_public_decrypt':
/usr/local/src/php-build/php-7.3.17/ext/openssl/openssl.c:5876: undefined reference to `EVP_PKEY_get0_RSA'
ext/openssl/.libs/openssl.o: In function `zif_openssl_sign':
/usr/local/src/php-build/php-7.3.17/ext/openssl/openssl.c:5984: undefined reference to `EVP_MD_CTX_new'
/usr/local/src/php-build/php-7.3.17/ext/openssl/openssl.c:5999: undefined reference to `EVP_MD_CTX_free'
ext/openssl/.libs/openssl.o: In function `zif_openssl_verify':
/usr/local/src/php-build/php-7.3.17/ext/openssl/openssl.c:6051: undefined reference to `EVP_MD_CTX_new'
/usr/local/src/php-build/php-7.3.17/ext/openssl/openssl.c:6058: undefined reference to `EVP_MD_CTX_free'
ext/openssl/.libs/openssl.o: In function `zif_openssl_seal':
/usr/local/src/php-build/php-7.3.17/ext/openssl/openssl.c:6145: undefined reference to `EVP_CIPHER_CTX_reset'
ext/openssl/.libs/openssl.o: In function `zif_openssl_digest':
/usr/local/src/php-build/php-7.3.17/ext/openssl/openssl.c:6376: undefined reference to `EVP_MD_CTX_new'
/usr/local/src/php-build/php-7.3.17/ext/openssl/openssl.c:6399: undefined reference to `EVP_MD_CTX_free'
ext/openssl/.libs/openssl.o: In function `zif_openssl_encrypt':
/usr/local/src/php-build/php-7.3.17/ext/openssl/openssl.c:6698: undefined reference to `EVP_CIPHER_CTX_reset'
ext/openssl/.libs/openssl.o: In function `zif_openssl_decrypt':
/usr/local/src/php-build/php-7.3.17/ext/openssl/openssl.c:6785: undefined reference to `EVP_CIPHER_CTX_reset'
ext/openssl/.libs/openssl.o: In function `sk_CONF_VALUE_num':
/usr/include/openssl/conf.h:30: undefined reference to `OPENSSL_sk_num'
ext/openssl/.libs/openssl.o: In function `sk_CONF_VALUE_value':
/usr/include/openssl/conf.h:30: undefined reference to `OPENSSL_sk_value'
ext/openssl/.libs/openssl.o: In function `zif_openssl_csr_sign':
/usr/local/src/php-build/php-7.3.17/ext/openssl/openssl.c:3459: undefined reference to `X509_REQ_get_subject_name'
/usr/local/src/php-build/php-7.3.17/ext/openssl/openssl.c:3468: undefined reference to `X509_getm_notBefore'
/usr/local/src/php-build/php-7.3.17/ext/openssl/openssl.c:3469: undefined reference to `X509_getm_notAfter'
ext/openssl/.libs/openssl.o: In function `php_openssl_make_REQ':
/usr/local/src/php-build/php-7.3.17/ext/openssl/openssl.c:3096: undefined reference to `X509_REQ_get_subject_name'
ext/openssl/.libs/openssl.o: In function `sk_CONF_VALUE_num':
/usr/include/openssl/conf.h:30: undefined reference to `OPENSSL_sk_num'
ext/openssl/.libs/openssl.o: In function `sk_CONF_VALUE_value':
/usr/include/openssl/conf.h:30: undefined reference to `OPENSSL_sk_value'
ext/openssl/.libs/openssl.o: In function `sk_CONF_VALUE_num':
/usr/include/openssl/conf.h:30: undefined reference to `OPENSSL_sk_num'
/usr/include/openssl/conf.h:30: undefined reference to `OPENSSL_sk_num'
ext/openssl/.libs/openssl.o: In function `sk_CONF_VALUE_value':
/usr/include/openssl/conf.h:30: undefined reference to `OPENSSL_sk_value'
ext/openssl/.libs/openssl.o: In function `php_openssl_pkey_init_and_assign_rsa':
/usr/local/src/php-build/php-7.3.17/ext/openssl/openssl.c:4156: undefined reference to `RSA_set0_key'
/usr/local/src/php-build/php-7.3.17/ext/openssl/openssl.c:4162: undefined reference to `RSA_set0_factors'
ext/openssl/.libs/openssl.o: In function `php_openssl_pkey_init_dsa':
/usr/local/src/php-build/php-7.3.17/ext/openssl/openssl.c:4190: undefined reference to `DSA_set0_pqg'
/usr/local/src/php-build/php-7.3.17/ext/openssl/openssl.c:4197: undefined reference to `DSA_set0_key'
ext/openssl/.libs/openssl.o: In function `php_openssl_pkey_init_dh':
/usr/local/src/php-build/php-7.3.17/ext/openssl/openssl.c:4267: undefined reference to `DH_set0_pqg'
ext/openssl/.libs/openssl.o: In function `php_openssl_dh_pub_from_priv':
/usr/local/src/php-build/php-7.3.17/ext/openssl/openssl.c:4244: undefined reference to `BN_with_flags'
ext/openssl/.libs/openssl.o: In function `php_openssl_pkey_init_dh':
/usr/local/src/php-build/php-7.3.17/ext/openssl/openssl.c:4281: undefined reference to `DH_set0_key'
ext/openssl/.libs/openssl.o: In function `php_openssl_pkey_init_dsa':
/usr/local/src/php-build/php-7.3.17/ext/openssl/openssl.c:4209: undefined reference to `DSA_get0_key'
/usr/local/src/php-build/php-7.3.17/ext/openssl/openssl.c:4210: undefined reference to `BN_is_zero'
ext/openssl/.libs/openssl.o: In function `php_openssl_pkey_init_and_assign_rsa':
/usr/local/src/php-build/php-7.3.17/ext/openssl/openssl.c:4169: undefined reference to `RSA_set0_crt_params'
ext/openssl/.libs/openssl.o: In function `php_openssl_pkey_init_dh':
/usr/local/src/php-build/php-7.3.17/ext/openssl/openssl.c:4274: undefined reference to `DH_set0_key'
ext/openssl/.libs/openssl.o: In function `zif_openssl_pkey_export_to_file':
/usr/local/src/php-build/php-7.3.17/ext/openssl/openssl.c:4564: undefined reference to `EVP_PKEY_get0_EC_KEY'
ext/openssl/.libs/openssl.o: In function `zif_openssl_pkey_export':
/usr/local/src/php-build/php-7.3.17/ext/openssl/openssl.c:4641: undefined reference to `EVP_PKEY_get0_EC_KEY'
ext/openssl/.libs/openssl.o: In function `sk_X509_free':
/usr/include/openssl/x509.h:99: undefined reference to `OPENSSL_sk_free'
ext/openssl/.libs/xp_ssl.o: In function `php_openssl_create_sni_server_ctx':
/usr/local/src/php-build/php-7.3.17/ext/openssl/xp_ssl.c:1377: undefined reference to `TLS_server_method'
ext/openssl/.libs/xp_ssl.o: In function `sk_X509_num':
/usr/include/openssl/x509.h:99: undefined reference to `OPENSSL_sk_num'
ext/openssl/.libs/xp_ssl.o: In function `sk_X509_value':
/usr/include/openssl/x509.h:99: undefined reference to `OPENSSL_sk_value'
ext/openssl/.libs/xp_ssl.o: In function `sk_X509_num':
/usr/include/openssl/x509.h:99: undefined reference to `OPENSSL_sk_num'
ext/openssl/.libs/xp_ssl.o: In function `php_openssl_setup_crypto':
/usr/local/src/php-build/php-7.3.17/ext/openssl/xp_ssl.c:1621: undefined reference to `TLS_server_method'
/usr/local/src/php-build/php-7.3.17/ext/openssl/xp_ssl.c:1678: undefined reference to `SSL_CTX_set_security_level'
/usr/local/src/php-build/php-7.3.17/ext/openssl/xp_ssl.c:1621: undefined reference to `TLS_client_method'
/usr/local/src/php-build/php-7.3.17/ext/openssl/xp_ssl.c:1719: undefined reference to `SSL_CTX_set_options'
ext/openssl/.libs/xp_ssl.o: In function `php_openssl_set_server_specific_opts':
/usr/local/src/php-build/php-7.3.17/ext/openssl/xp_ssl.c:1308: undefined reference to `SSL_CTX_get_options'
/usr/local/src/php-build/php-7.3.17/ext/openssl/xp_ssl.c:1335: undefined reference to `SSL_CTX_set_options'
ext/openssl/.libs/xp_ssl.o: In function `sk_GENERAL_NAME_num':
/usr/include/openssl/x509v3.h:166: undefined reference to `OPENSSL_sk_num'
ext/openssl/.libs/xp_ssl.o: In function `sk_GENERAL_NAME_value':
/usr/include/openssl/x509v3.h:166: undefined reference to `OPENSSL_sk_value'
ext/openssl/.libs/xp_ssl.o: In function `sk_GENERAL_NAME_pop_free':
/usr/include/openssl/x509v3.h:166: undefined reference to `OPENSSL_sk_pop_free'
/usr/include/openssl/x509v3.h:166: undefined reference to `OPENSSL_sk_pop_free'
/usr/include/openssl/x509v3.h:166: undefined reference to `OPENSSL_sk_pop_free'
ext/ftp/.libs/php_ftp.o: In function `zm_startup_ftp':
/usr/local/src/php-build/php-7.3.17/ext/ftp/php_ftp.c:321: undefined reference to `OPENSSL_init_ssl'
/usr/local/src/php-build/php-7.3.17/ext/ftp/php_ftp.c:322: undefined reference to `OPENSSL_init_crypto'
/usr/local/src/php-build/php-7.3.17/ext/ftp/php_ftp.c:323: undefined reference to `OPENSSL_init_crypto'
/usr/local/src/php-build/php-7.3.17/ext/ftp/php_ftp.c:324: undefined reference to `OPENSSL_init_crypto'
/usr/local/src/php-build/php-7.3.17/ext/ftp/php_ftp.c:326: undefined reference to `OPENSSL_init_ssl'
ext/ftp/.libs/ftp.o: In function `ftp_login':
/usr/local/src/php-build/php-7.3.17/ext/ftp/ftp.c:275: undefined reference to `TLS_client_method'
/usr/local/src/php-build/php-7.3.17/ext/ftp/ftp.c:284: undefined reference to `SSL_CTX_set_options'
ext/phar/.libs/util.o: In function `phar_verify_signature':
/usr/local/src/php-build/php-7.3.17/ext/phar/util.c:1561: undefined reference to `EVP_MD_CTX_new'
/usr/local/src/php-build/php-7.3.17/ext/phar/util.c:1593: undefined reference to `EVP_MD_CTX_free'
/usr/local/src/php-build/php-7.3.17/ext/phar/util.c:1584: undefined reference to `EVP_MD_CTX_free'
ext/phar/.libs/util.o: In function `phar_create_signature':
/usr/local/src/php-build/php-7.3.17/ext/phar/util.c:1858: undefined reference to `EVP_MD_CTX_new'
/usr/local/src/php-build/php-7.3.17/ext/phar/util.c:1890: undefined reference to `EVP_MD_CTX_free'
collect2: error: ld returned 1 exit status
make: *** [sapi/cli/php] Error 1
mkdir: cannot create directory '/opt/alt/php-fpm73/usr/var/sockets/': No such file or directory
mkdir: cannot create directory '/opt/alt/php-fpm73/usr/etc/php-fpm.d/': No such file or directory
mkdir: cannot create directory '/opt/alt/php-fpm73/usr/etc/php-fpm.d/users/': No such file or directory
/usr/local/src/php-fpm-7.3.sh: line 98: /opt/alt/php-fpm73/usr/etc/php-fpm.d/users.conf: No such file or directory
/usr/local/src/php-fpm-7.3.sh: line 99: /opt/alt/php-fpm73/usr/etc/php-fpm.conf: No such file or directory
/usr/local/src/php-fpm-7.3.sh: line 101: /opt/alt/php-fpm73/usr/etc/php-fpm.d/cwpsvc.conf: No such file or directory
shell-init: error retrieving current directory: getcwd: cannot access parent directories: No such file or directory
shell-init: error retrieving current directory: getcwd: cannot access parent directories: No such file or directory
Skipping as php build failed
shell-init: error retrieving current directory: getcwd: cannot access parent directories: No such file or directory
Skipping as php build failed
shell-init: error retrieving current directory: getcwd: cannot access parent directories: No such file or directory
Skipping as php build failed
exe:/opt/alt/php-fpm73/usr/sbin/php-fpm
Redirecting to /bin/systemctl restart httpd.service

Build Completed
###################

Error:Can't add notification!


You can also share the log file.

Online
***
Re: PHP Version Switcher v2 not chaning PHP version
« Reply #7 on: May 07, 2020, 08:38:25 PM »
Try yum install openssl-dev or devel, not sure which.  Then try again
Google Hangouts:  rcschaff82@gmail.com

Offline
*
Re: PHP Version Switcher v2 not chaning PHP version
« Reply #8 on: May 07, 2020, 08:45:59 PM »
Try yum install openssl-dev or devel, not sure which.  Then try again
Package 1:openssl-devel-1.0.2k-19.el7.x86_64 already installed and latest version
Nothing to do
OpenSSL 1.0.2k  26 Jan 2017

Offline
*****
Re: PHP Version Switcher v2 not chaning PHP version
« Reply #9 on: May 07, 2020, 10:47:44 PM »
contact support for further checks. seems something is messed up on your os.

Offline
*
Re: PHP Version Switcher v2 not chaning PHP version
« Reply #10 on: May 07, 2020, 10:50:42 PM »
I just installed Cwp on Amazon CentOS 7 today but i can't change php version

Offline
*****
Re: PHP Version Switcher v2 not chaning PHP version
« Reply #11 on: May 08, 2020, 03:58:01 AM »
"I just installed Cwp on Amazon CentOS 7 today but i can't change php version " from this message i can't seems to understand ensure you provide more details like server ram which php you're building etc and whats the error message in log ensure you've at least 2 gb ram for php 7 build.

Offline
*
Re: PHP Version Switcher v2 not chaning PHP version
« Reply #12 on: May 08, 2020, 11:50:36 AM »
yes it's just 1GB ram server. I want to host just 1 site on it.

I'll upgrade to 2 and test it thanks!

Online
***
Re: PHP Version Switcher v2 not chaning PHP version
« Reply #13 on: May 08, 2020, 12:41:45 PM »
You could also enable swap
Google Hangouts:  rcschaff82@gmail.com