Now working on the EL7 servers.
What's the point? CentOS 7 is a sitting duck at this point.
Getting stuck here - Did you encounter this?
checking for BZip2 support... yes
checking for BZ2_bzerror in -lbz2... no
configure: error: bz2 module requires libbz2 >= 1.0.0
make: *** No targets specified and no makefile found. Stop.
make: *** No rule to make target `install'. Stop.
shell-init: error retrieving current directory: getcwd: cannot access parent directories: No such file or directory
shell-init: error retrieving current directory: getcwd: cannot access parent directories: No such file or directory
Skipping as php build failed
shell-init: error retrieving current directory: getcwd: cannot access parent directories: No such file or directory
shell-init: error retrieving current directory: getcwd: cannot access parent directories: No such file or directory
Skipping as php build failed
shell-init: error retrieving current directory: getcwd: cannot access parent directories: No such file or directory
Skipping as php build failed
shell-init: error retrieving current directory: getcwd: cannot access parent directories: No such file or directory
Loaded plugins: fastestmirror
Loading mirror speeds from cached hostfile
* epel: dl.fedoraproject.org
Package libsodium-1.0.18-1.el7.x86_64 already installed and latest version
Package libsodium-devel-1.0.18-1.el7.x86_64 already installed and latest version
Nothing to do
chdir: error retrieving current directory: getcwd: cannot access parent directories: No such file or directory
% Total % Received % Xferd Average Speed Time Time Time Current
Dload Upload Total Spent Left Speed
100 28505 100 28505 0 0 35065 0 --:--:-- --:--:-- --:--:-- 35061
/usr/local/cwpsrv/htdocs/resources/conf/el7/php-fpm_selector/external_modules/8.3/sodium.sh: line 9: /opt/alt/php-fpm83/usr/bin/phpize: No such file or directory
/usr/local/cwpsrv/htdocs/resources/conf/el7/php-fpm_selector/external_modules/8.3/sodium.sh: line 10: ./configure: No such file or directory
make: *** No targets specified and no makefile found. Stop.
make: *** No rule to make target `install'. Stop.
/usr/local/cwpsrv/htdocs/resources/conf/el7/php-fpm_selector/external_modules/8.3/sodium.sh: line 14: /opt/alt/php-fpm83/usr/bin/php-config: No such file or directory
ERROR: Missing extension file /sodium.so
exe:/opt/alt/php-fpm83/usr/sbin/php-fpm
Build Completed
###################
Error:Can't add notification!