Author Topic: php_selector3 Error  (Read 2262 times)

0 Members and 1 Guest are viewing this topic.

Offline
*
Re: php_selector3 Error
« Reply #15 on: January 24, 2019, 12:35:41 AM »
Any solution? I still have the problem

Offline
*
Re: php_selector3 Error
« Reply #16 on: June 05, 2019, 11:32:40 AM »
Have same problem. Someone can help me?

mkdir: cannot create directory '/opt/alt/php-fpm73/usr/var/sockets/': No such file or directory
mkdir: cannot create directory '/opt/alt/php-fpm73/usr/etc/php-fpm.d/': No such file or directory
mkdir: cannot create directory '/opt/alt/php-fpm73/usr/etc/php-fpm.d/users/': No such file or directory
/usr/local/src/php-fpm-7.3.sh: line 92: /opt/alt/php-fpm73/usr/etc/php-fpm.d/users.conf: No such file or directory
/usr/local/src/php-fpm-7.3.sh: line 93: /opt/alt/php-fpm73/usr/etc/php-fpm.conf: No such file or directory
/usr/local/src/php-fpm-7.3.sh: line 95: /opt/alt/php-fpm73/usr/etc/php-fpm.d/cwpsvc.conf: No such file or directory
cp: cannot stat 'sapi/fpm/php-fpm.service': No such file or directory
sed: can't read /usr/lib/systemd/system/php-fpm73.service: No such file or directory
sed: can't read /usr/lib/systemd/system/php-fpm73.service: No such file or directory
Failed to execute operation: No such file or directory
shell-init: error retrieving current directory: getcwd: cannot access parent directories: No such file or directory
shell-init: error retrieving current directory: getcwd: cannot access parent directories: No such file or directory
Skipping as php build failed
shell-init: error retrieving current directory: getcwd: cannot access parent directories: No such file or directory
Skipping as php build failed
shell-init: error retrieving current directory: getcwd: cannot access parent directories: No such file or directory
Skipping as php build failed
exe:/opt/alt/php-fpm73/usr/sbin/php-fpm
Redirecting to /bin/systemctl restart httpd.service