Install Error

Started by serhanyildiz, October 23, 2014, 01:57:05 PM

Previous topic - Next topic

serhanyildiz

Hi all,
I'm installing CentOS web panel to a new VPS
New VPS's features:
Operating System:CentOS 6 64bit
Memory:2 GB
VSwap:1024 MB
Disk Space:100 GB
Bandwidth:1000 GB


I am getting the following error:

Generating phar.php
Generating phar.phar

Parse error: syntax error, unexpected '/', expecting ')' in /tmp/php-build/php-5.4.27/ext/phar/phar.php on line 20
make: *** [ext/phar/phar.phar] Hata 255
Generating phar.phar

Parse error: syntax error, unexpected '/', expecting ')' in /tmp/php-build/php-5.4.27/ext/phar/phar.php on line 20
make: *** [ext/phar/phar.phar] Hata 255

Compiler requires 512 MB RAM + SWAP
Installation FAILED at php
  % Total    % Received % Xferd  Average Speed   Time    Time     Time  Current
                                 Dload  Upload   Total   Spent    Left  Speed
100   605  100   605    0     0   2897      0 --:--:-- --:--:-- --:--:--  8287
sh: line 33: /usr/local/bin/php: Böyle bir dosya ya da dizin yok
grep: /etc/init.d/httpd: Böyle bir dosya ya da dizin yok
Array
(
    [operation] => upload
)

Administrator

what is your centos server language?, CWP is using English only.


erm3nda

I guess this is duplicated question by same guy  :(
8==D it's a function that try to compare 8 (int) against D (string) which returns True or False depending on the asker.