Author Topic: error while compiling php-fpm v5.3.3  (Read 667 times)

0 Members and 1 Guest are viewing this topic.

Offline
***
error while compiling php-fpm v5.3.3
« on: June 01, 2019, 10:58:03 PM »
I was trying to compile php v5.3.3 (the oldest currently available on CWP) under php-fpm menu, in order to host an old site of mine.
Using the trail command after it took too long, I found this error:

Code: [Select]

[root@cwp ~]# tail -f /var/log/php-selector-rebuild.log
shell-init: error retrieving current directory: getcwd: cannot access parent directories: No such file or directory
Skipping as php build failed
exe:/opt/alt/php-fpm53/usr/sbin/php-fpm
Redirecting to /bin/systemctl restart httpd.service


Build Completed
###################




Error:Can't add notification!


Any idea what's the issue?


Also, ever since, whenever I get into php-fpm menu again, I get this in the bottom:
Code: [Select]
Task already running in the background, please wait a few minutes and then check again!!!How can I remove that?

Offline
***
Re: error while compiling php-fpm v5.3.3
« Reply #1 on: June 01, 2019, 11:22:45 PM »
Ok, I've used the "reset options" link on the right side of v5.3, and it removed v5.3 so I could use that screen again.
I'm currently compiling v5.3.29 this time and I'll hope it'll finish this time.

Offline
*****
Re: error while compiling php-fpm v5.3.3
« Reply #2 on: June 02, 2019, 12:37:23 AM »
It means its still running
allow it to run